Reaction Details
TargetMicrotubule-associated protein 2
LigandBDBM50197353
Substrate/Competitorn/a
Meas. Tech.ChEMBL_1619395 (CHEMBL3861564)
IC50 121±n/a nM
Citation Weglarz-Tomczak, EBurda-Grabowska, MGiurg, MMucha, A Identification of methionine aminopeptidase 2 as a molecular target of the organoselenium drug ebselen and its derivatives/analogues: Synthesis, inhibitory activity and molecular modeling study. Bioorg Med Chem Lett26:5254-5259 (2016) 
 
Microtubule-associated protein 2
Name:Microtubule-associated protein 2
Type:PROTEIN
Mol. Mass.:199423.64
Organism:Homo sapiens (Human)
Description:ChEMBL_107603
Residue:1827
BDBM50197353
NameBDBM50197353
Synonyms:CHEMBL3932329
TypeSmall organic molecule
Emp. Form.C14H10ClNOSe
Mol. Mass.322.65
SMILESCc1ccc(c(Cl)c1)-n1[se]c2ccccc2c1=O