Reaction Details
TargetTumor necrosis factor receptor superfamily member 16
LigandBDBM50396070
Substrate/Competitorn/a
Meas. Tech.ChEMBL_1619564 (CHEMBL3861733)
IC50 244000±n/a nM
Citation Norman, BHMcDermott, JS Targeting the Nerve Growth Factor (NGF) Pathway in Drug Discovery. Potential Applications to New Therapies for Chronic Pain. J Med Chem60:66-88 (2017) 
 
Tumor necrosis factor receptor superfamily member 16
Name:Tumor necrosis factor receptor superfamily member 16
Type:PROTEIN
Mol. Mass.:45159.83
Organism:Homo sapiens (Human)
Description:ChEMBL_346884
Residue:427
BDBM50396070
NameBDBM50396070
Synonyms:CHEMBL1397270
TypeSmall organic molecule
Emp. Form.C13H10N4O3
Mol. Mass.270.2435
SMILESCc1cc2nc3c(nc(=O)[nH]c3=O)n(C)c2cc1C=O