Reaction Details
TargetTumor necrosis factor receptor superfamily member 16
LigandBDBM50029495
Substrate/Competitorn/a
Meas. Tech.ChEMBL_1619564 (CHEMBL3861733)
IC50 110000±n/a nM
Citation Norman, BHMcDermott, JS Targeting the Nerve Growth Factor (NGF) Pathway in Drug Discovery. Potential Applications to New Therapies for Chronic Pain. J Med Chem60:66-88 (2017) 
 
Tumor necrosis factor receptor superfamily member 16
Name:Tumor necrosis factor receptor superfamily member 16
Type:PROTEIN
Mol. Mass.:45159.83
Organism:Homo sapiens (Human)
Description:ChEMBL_346884
Residue:427
BDBM50029495
NameBDBM50029495
Synonyms:7-Benzoylamino-4-methyl-9-oxo-4,9-dihydro-pyrazolo[5,1-b]quinazoline-2-carboxylic acid | CHEMBL137953
TypeSmall organic molecule
Emp. Form.C19H14N4O4
Mol. Mass.362.3389
SMILESCn1c2cc(nn2c(=O)c2cc(NC(=O)c3ccccc3)ccc12)C(O)=O