Reaction Details
TargetTumor necrosis factor receptor superfamily member 16
LigandBDBM50111443
Substrate/Competitorn/a
Meas. Tech.ChEMBL_1619564 (CHEMBL3861733)
IC50>300000±n/a nM
Citation Norman, BHMcDermott, JS Targeting the Nerve Growth Factor (NGF) Pathway in Drug Discovery. Potential Applications to New Therapies for Chronic Pain. J Med Chem60:66-88 (2017) 
 
Tumor necrosis factor receptor superfamily member 16
Name:Tumor necrosis factor receptor superfamily member 16
Type:PROTEIN
Mol. Mass.:45159.83
Organism:Homo sapiens (Human)
Description:ChEMBL_346884
Residue:427
BDBM50111443
NameBDBM50111443
Synonyms:2-(2-Hydroxy-ethylamino)-5-nitro-benzo[de]isoquinoline-1,3-dione(ALE-0540) | CHEMBL440470
TypeSmall organic molecule
Emp. Form.C14H11N3O5
Mol. Mass.301.2542
SMILESOCCNN1C(=O)c2cccc3cc(cc(C1=O)c23)[N+]([O-])=O