Reaction Details
TargetProto-oncogene tyrosine-protein kinase Src
LigandBDBM50197709
Substrate/Competitorn/a
Meas. Tech.ChEMBL_1619706 (CHEMBL3861875)
IC50 0.430000±n/a nM
Citation Ebiike, HTaka, NMatsushita, MOhmori, MTakami, KHyohdoh, IKohchi, MHayase, TNishii, HMorikami, KNakanishi, YAkiyama, NShindoh, HIshii, NIsobe, TMatsuoka, H Discovery of [5-Amino-1-(2-methyl-3H-benzimidazol-5-yl)pyrazol-4-yl]-(1H-indol-2-yl)methanone (CH5183284/Debio 1347), An Orally Available and Selective Fibroblast Growth Factor Receptor (FGFR) Inhibitor. J Med Chem59:10586-10600 (2016) 
 
Proto-oncogene tyrosine-protein kinase Src
Name:Proto-oncogene tyrosine-protein kinase Src
Type:Protein
Mol. Mass.:59838.60
Organism:Homo sapiens (Human)
Description:P12931
Residue:536
BDBM50197709
NameBDBM50197709
Synonyms:CHEMBL3984621
TypeSmall organic molecule
Emp. Form.C23H22ClN5O3
Mol. Mass.451.905
SMILESNc1c(cnn1-c1cc(O)ccc1Cl)C(=O)c1cc2cc(CN3CCOCC3)ccc2[nH]1