Reaction Details
TargetCarbonic anhydrase 9
LigandBDBM50197813
Substrate/Competitorn/a
Meas. Tech.ChEMBL_1619738 (CHEMBL3861907)
Ki 17±n/a nM
Citation Nocentini, AFerraroni, MCarta, FCeruso, MGratteri, PLanzi, CMasini, ESupuran, CT Benzenesulfonamides Incorporating Flexible Triazole Moieties Are Highly Effective Carbonic Anhydrase Inhibitors: Synthesis and Kinetic, Crystallographic, Computational, and Intraocular Pressure Lowering Investigations. J Med Chem59:10692-10704 (2016) 
 
Carbonic anhydrase 9
Name:Carbonic anhydrase 9
Type:Enzyme
Mol. Mass.:49669.03
Organism:Homo sapiens (Human)
Description:Catalytic domain of human cloned isozyme was used in the assay
Residue:459
BDBM50197813
NameBDBM50197813
Synonyms:CHEMBL3973519
TypeSmall organic molecule
Emp. Form.C14H13N5O3S
Mol. Mass.331.35
SMILESNS(=O)(=O)c1ccc(cc1)-n1cc(COc2cccnc2)nn1