Reaction Details
TargetCarbonic anhydrase 2
LigandBDBM50197817
Substrate/Competitorn/a
Meas. Tech.ChEMBL_1619737 (CHEMBL3861906)
Ki 12±n/a nM
Citation Nocentini, AFerraroni, MCarta, FCeruso, MGratteri, PLanzi, CMasini, ESupuran, CT Benzenesulfonamides Incorporating Flexible Triazole Moieties Are Highly Effective Carbonic Anhydrase Inhibitors: Synthesis and Kinetic, Crystallographic, Computational, and Intraocular Pressure Lowering Investigations. J Med Chem59:10692-10704 (2016) 
 
Carbonic anhydrase 2
Name:Carbonic anhydrase 2
Type:Enzyme
Mol. Mass.:29250.71
Organism:Homo sapiens (Human)
Description:P00918
Residue:260
BDBM50197817
NameBDBM50197817
Synonyms:CHEMBL3918758
TypeSmall organic molecule
Emp. Form.C16H16N4O4S
Mol. Mass.360.388
SMILESCOc1cccc(c1)-n1cc(COc2ccc(cc2)S(N)(=O)=O)nn1