Reaction Details
TargetCarbonic anhydrase 9
LigandBDBM50262062
Substrate/Competitorn/a
Meas. Tech.ChEMBL_1619738 (CHEMBL3861907)
Ki 26±n/a nM
Citation Nocentini, AFerraroni, MCarta, FCeruso, MGratteri, PLanzi, CMasini, ESupuran, CT Benzenesulfonamides Incorporating Flexible Triazole Moieties Are Highly Effective Carbonic Anhydrase Inhibitors: Synthesis and Kinetic, Crystallographic, Computational, and Intraocular Pressure Lowering Investigations. J Med Chem59:10692-10704 (2016) 
 
Carbonic anhydrase 9
Name:Carbonic anhydrase 9
Type:Enzyme
Mol. Mass.:49669.03
Organism:Homo sapiens (Human)
Description:Catalytic domain of human cloned isozyme was used in the assay
Residue:459
BDBM50262062
NameBDBM50262062
Synonyms:4-(4-phenyl-1H-1,2,3-triazol-1-yl)benzenesulfonamide | CHEMBL513184
TypeSmall organic molecule
Emp. Form.C14H12N4O2S
Mol. Mass.300.336
SMILESNS(=O)(=O)c1ccc(cc1)-n1cc(nn1)-c1ccccc1