Reaction Details
Target17-beta-hydroxysteroid dehydrogenase 14
LigandBDBM50197828
Substrate/Competitorn/a
Meas. Tech.ChEMBL_1619749 (CHEMBL3861918)
Ki 132±n/a nM
Citation Braun, FBertoletti, NMöller, GAdamski, JSteinmetzer, TSalah, MAbdelsamie, ASvan Koppen, CJHeine, AKlebe, GMarchais-Oberwinkler, S First Structure-Activity Relationship of 17ß-Hydroxysteroid Dehydrogenase Type 14 Nonsteroidal Inhibitors and Crystal Structures in Complex with the Enzyme. J Med Chem59:10719-10737 (2016) 
 
17-beta-hydroxysteroid dehydrogenase 14
Name:17-beta-hydroxysteroid dehydrogenase 14
Type:PROTEIN
Mol. Mass.:28316.15
Organism:Homo sapiens (Human)
Description:ChEMBL_114829
Residue:270
BDBM50197828
NameBDBM50197828
Synonyms:CHEMBL3904073
TypeSmall organic molecule
Emp. Form.C18H12FNO5
Mol. Mass.341.29
SMILESOc1cccc(C(=O)c2cccc(-c3cccc(O)c3F)[n+]2[O-])c1O