Reaction Details
Target17-beta-hydroxysteroid dehydrogenase 14
LigandBDBM50197841
Substrate/Competitorn/a
Meas. Tech.ChEMBL_1619749 (CHEMBL3861918)
Ki 9.0±n/a nM
Citation Braun, FBertoletti, NMöller, GAdamski, JSteinmetzer, TSalah, MAbdelsamie, ASvan Koppen, CJHeine, AKlebe, GMarchais-Oberwinkler, S First Structure-Activity Relationship of 17ß-Hydroxysteroid Dehydrogenase Type 14 Nonsteroidal Inhibitors and Crystal Structures in Complex with the Enzyme. J Med Chem59:10719-10737 (2016) 
 
17-beta-hydroxysteroid dehydrogenase 14
Name:17-beta-hydroxysteroid dehydrogenase 14
Type:PROTEIN
Mol. Mass.:28316.15
Organism:Homo sapiens (Human)
Description:ChEMBL_114829
Residue:270
BDBM50197841
NameBDBM50197841
Synonyms:CHEMBL3932068
TypeSmall organic molecule
Emp. Form.C26H20FNO4
Mol. Mass.429.4397
SMILESCc1cc(ccc1O)-c1ccc(nc1-c1ccc(O)c(C)c1)C(=O)c1ccc(F)c(O)c1