Reaction Details
TargetTransthyretin
LigandBDBM50301375
Substrate/Competitorn/a
Meas. Tech.ChEMBL_1620067 (CHEMBL3862350)
IC50 2200±n/a nM
Citation Simões, CJVAlmeida, ZLCosta, DJesus, CSHCardoso, ALAlmeida, MRSaraiva, MJPinho E Melo, TMVDBrito, RMM A novel bis-furan scaffold for transthyretin stabilization and amyloid inhibition. Eur J Med Chem121:823-840 (2016) 
 
Transthyretin
Name:Transthyretin
Type:Enzyme
Mol. Mass.:15884.31
Organism:Homo sapiens (Human)
Description:P02766
Residue:147
BDBM50301375
NameBDBM50301375
Synonyms:3,3',5,5'-tetraiodo-L-thyronine 4-(4-hydroxy-3,5-diiodophenoxy)-3,5-diiodo-L-phenylalanine L-T4 O-(4-hydroxy-3,5-diiodophenyl)-3,5-diiodo-L-tyrosine | levothyroxine
TypeSmall organic molecule
Emp. Form.C15H11I4NO4
Mol. Mass.776.87
SMILESN[C@@H](Cc1cc(I)c(Oc2cc(I)c(O)c(I)c2)c(I)c1)C(O)=O