Reaction Details
TargetAurora kinase A
LigandBDBM50197972
Substrate/Competitorn/a
Meas. Tech.ChEMBL_1620440 (CHEMBL3862723)
IC50 11000±n/a nM
Citation Kilchmann, FMarcaida, MJKotak, SSchick, TBoss, SDAwale, MGönczy, PReymond, JL Discovery of a Selective Aurora A Kinase Inhibitor by Virtual Screening. J Med Chem59:7188-211 (2016) 
 
Aurora kinase A
Name:Aurora kinase A
Type:Serine/threonine-protein kinase
Mol. Mass.:45830.98
Organism:Homo sapiens (Human)
Description:O14965
Residue:403
BDBM50197972
NameBDBM50197972
Synonyms:CHEMBL3982818
TypeSmall organic molecule
Emp. Form.C16H13N5O2
Mol. Mass.307.3067
SMILESCNC(=O)c1ccc2[nH]c(=O)n(-c3nc4ccccc4[nH]3)c2c1