Reaction Details
TargetAurora kinase A
LigandBDBM50198042
Substrate/Competitorn/a
Meas. Tech.ChEMBL_1620440 (CHEMBL3862723)
IC50 380±n/a nM
Citation Kilchmann, FMarcaida, MJKotak, SSchick, TBoss, SDAwale, MGönczy, PReymond, JL Discovery of a Selective Aurora A Kinase Inhibitor by Virtual Screening. J Med Chem59:7188-211 (2016) 
 
Aurora kinase A
Name:Aurora kinase A
Type:Serine/threonine-protein kinase
Mol. Mass.:45830.98
Organism:Homo sapiens (Human)
Description:O14965
Residue:403
BDBM50198042
NameBDBM50198042
Synonyms:CHEMBL3935395
TypeSmall organic molecule
Emp. Form.C19H19N3OS
Mol. Mass.337.439
SMILESCCN1\C(S\C(=C/c2ccncc2)C1=O)=N\c1ccc(CC)cc1