Reaction Details
TargetAurora kinase A
LigandBDBM50198072
Substrate/Competitorn/a
Meas. Tech.ChEMBL_1620440 (CHEMBL3862723)
IC50>200000±n/a nM
Citation Kilchmann, FMarcaida, MJKotak, SSchick, TBoss, SDAwale, MGönczy, PReymond, JL Discovery of a Selective Aurora A Kinase Inhibitor by Virtual Screening. J Med Chem59:7188-211 (2016) 
 
Aurora kinase A
Name:Aurora kinase A
Type:Serine/threonine-protein kinase
Mol. Mass.:45830.98
Organism:Homo sapiens (Human)
Description:O14965
Residue:403
BDBM50198072
NameBDBM50198072
Synonyms:CHEMBL3912939
TypeSmall organic molecule
Emp. Form.C14H9ClN4O
Mol. Mass.284.7
SMILESClc1ccc2n(-c3nc4ccccc4[nH]3)c(=O)[nH]c2c1