Reaction Details
TargetAurora kinase A
LigandBDBM50198079
Substrate/Competitorn/a
Meas. Tech.ChEMBL_1620440 (CHEMBL3862723)
IC50 190±n/a nM
Citation Kilchmann, FMarcaida, MJKotak, SSchick, TBoss, SDAwale, MGönczy, PReymond, JL Discovery of a Selective Aurora A Kinase Inhibitor by Virtual Screening. J Med Chem59:7188-211 (2016) 
 
Aurora kinase A
Name:Aurora kinase A
Type:Serine/threonine-protein kinase
Mol. Mass.:45830.98
Organism:Homo sapiens (Human)
Description:O14965
Residue:403
BDBM50198079
NameBDBM50198079
Synonyms:CHEMBL3924918
TypeSmall organic molecule
Emp. Form.C21H23N5O2S
Mol. Mass.409.505
SMILESCCc1ccc(cc1)\N=C1/S\C(=C/c2ccnc(NC(=O)CCN)c2)C(=O)N1C