Reaction Details
TargetAurora kinase B/Inner centromere protein
LigandBDBM50277545
Substrate/Competitorn/a
Meas. Tech.ChEMBL_1620442 (CHEMBL3862725)
IC50 1.1±n/a nM
Citation Kilchmann, FMarcaida, MJKotak, SSchick, TBoss, SDAwale, MGönczy, PReymond, JL Discovery of a Selective Aurora A Kinase Inhibitor by Virtual Screening. J Med Chem59:7188-211 (2016) 
 
Aurora kinase B/Inner centromere protein
Name:Aurora kinase B/Inner centromere protein
Synonyms:Aurora B/Incenp
Type:Protein Complex
Mol. Mass.:n/a
Description:n/a
Components:This complex has 2 components.
Component 1
Name:Aurora kinase B
Type:Protein
Mol. Mass.:39327.72
Organism:Homo sapiens (Human)
Description:Q96GD4
Residue:344
Component 2
Name:Inner centromere protein
Synonyms:INCENP | INCE_HUMAN
Type:Protein
Mol. Mass.:105461.33
Organism:Homo sapiens (Human)
Description:Q9NQS7
Residue:918
BDBM50277545
NameBDBM50277545
Synonyms:4-(9-chloro-7-(2-fluoro-6-methoxyphenyl)-5H-benzo[c]pyrimido[4,5-e]azepin-2-ylamino)-2-methoxybenzoic acid CHEMBL483158 US10092556, Example MLN8237 | US9346787, MLN8237
TypeSmall organic molecule
Emp. Form.C27H20ClFN4O4
Mol. Mass.518.924
SMILESCOc1cc(Nc2ncc3CN=C(c4cc(Cl)ccc4-c3n2)c2c(F)cccc2OC)ccc1C(O)=O