Reaction Details
TargetAcetylcholinesterase
LigandBDBM55727
Substrate/Competitorn/a
Meas. Tech.ChEMBL_1620689 (CHEMBL3862972)
IC50 30±n/a nM
Citation Engdahl, CKnutsson, SEkström, FLinusson, A Discovery of Selective Inhibitors Targeting Acetylcholinesterase 1 from Disease-Transmitting Mosquitoes. J Med Chem59:9409-9421 (2016) 
 
Acetylcholinesterase
Name:Acetylcholinesterase
Type:Enzyme
Mol. Mass.:67792.70
Organism:Homo sapiens (Human)
Description:P22303
Residue:614
BDBM55727
NameBDBM55727
Synonyms:2-(2,4-dichlorophenoxy)-N-[4-(1-piperidinylmethyl)phenyl]acetamide 2-(2,4-dichlorophenoxy)-N-[4-(piperidinomethyl)phenyl]acetamide MLS000663765 cid_1395053
TypeSmall organic molecule
Emp. Form.C20H22Cl2N2O2
Mol. Mass.393.307
SMILESClc1ccc(OCC(=O)Nc2ccc(CN3CCCCC3)cc2)c(Cl)c1