Reaction Details
TargetAcetylcholinesterase
LigandBDBM50198373
Substrate/Competitorn/a
Meas. Tech.ChEMBL_1620687 (CHEMBL3862970)
IC50 2900±n/a nM
Citation Engdahl, CKnutsson, SEkström, FLinusson, A Discovery of Selective Inhibitors Targeting Acetylcholinesterase 1 from Disease-Transmitting Mosquitoes. J Med Chem59:9409-9421 (2016) 
 
Acetylcholinesterase
Name:Acetylcholinesterase
Type:PROTEIN
Mol. Mass.:80902.47
Organism:Anopheles gambiae
Description:ChEMBL_104567
Residue:737
BDBM50198373
NameBDBM50198373
Synonyms:CHEMBL3960962
TypeSmall organic molecule
Emp. Form.C23H23NO
Mol. Mass.329.4348
SMILESC(Oc1ccc(CN2CCc3ccccc3C2)cc1)c1ccccc1