Reaction Details
TargetAcetylcholinesterase
LigandBDBM50198437
Substrate/Competitorn/a
Meas. Tech.ChEMBL_1620687 (CHEMBL3862970)
IC50 8300±n/a nM
Citation Engdahl, CKnutsson, SEkström, FLinusson, A Discovery of Selective Inhibitors Targeting Acetylcholinesterase 1 from Disease-Transmitting Mosquitoes. J Med Chem59:9409-9421 (2016) 
 
Acetylcholinesterase
Name:Acetylcholinesterase
Type:PROTEIN
Mol. Mass.:80902.47
Organism:Anopheles gambiae
Description:ChEMBL_104567
Residue:737
BDBM50198437
NameBDBM50198437
Synonyms:CHEMBL577016 | GNF-Pf-5524
TypeSmall organic molecule
Emp. Form.C24H23N3OS2
Mol. Mass.433.589
SMILESCCSc1nc2sc3CN(Cc4ccccc4)CCc3c2c(=O)n1-c1ccccc1