Reaction Details
TargetProtein polybromo-1
LigandBDBM50198440
Substrate/Competitorn/a
Meas. Tech.ChEBML_1620730
Kd 11500±n/a nM
Citation Myrianthopoulos, VGaboriaud-Kolar, NTallant, CHall, MLGrigoriou, SBrownlee, PMFedorov, ORogers, CHeidenreich, DWanior, MDrosos, NMexia, NSavitsky, PBagratuni, TKastritis, ETerpos, EFilippakopoulos, PMüller, SSkaltsounis, ALDowns, JAKnapp, SMikros, E Discovery and Optimization of a Selective Ligand for the Switch/Sucrose Nonfermenting-Related Bromodomains of Polybromo Protein-1 by the Use of Virtual Screening and Hydration Analysis. J Med Chem59:8787-8803 (2016) 
 
Protein polybromo-1
Name:Protein polybromo-1
Type:PROTEIN
Mol. Mass.:192953.62
Organism:Homo sapiens (Human)
Description:ChEMBL_104264
Residue:1689
BDBM50198440
NameBDBM50198440
Synonyms:CHEMBL3945847
TypeSmall organic molecule
Emp. Form.C19H18N2O
Mol. Mass.290.359
SMILESCOc1ccc(cc1)C(C(CC#N)CC#N)c1ccccc1