Reaction Details
TargetProtein polybromo-1
LigandBDBM50198447
Substrate/Competitorn/a
Meas. Tech.ChEBML_1620730
Kd 43±n/a nM
Citation Myrianthopoulos, VGaboriaud-Kolar, NTallant, CHall, MLGrigoriou, SBrownlee, PMFedorov, ORogers, CHeidenreich, DWanior, MDrosos, NMexia, NSavitsky, PBagratuni, TKastritis, ETerpos, EFilippakopoulos, PMüller, SSkaltsounis, ALDowns, JAKnapp, SMikros, E Discovery and Optimization of a Selective Ligand for the Switch/Sucrose Nonfermenting-Related Bromodomains of Polybromo Protein-1 by the Use of Virtual Screening and Hydration Analysis. J Med Chem59:8787-8803 (2016) 
 
Protein polybromo-1
Name:Protein polybromo-1
Type:PROTEIN
Mol. Mass.:192953.62
Organism:Homo sapiens (Human)
Description:ChEMBL_104264
Residue:1689
BDBM50198447
NameBDBM50198447
Synonyms:CHEMBL3899245
TypeSmall organic molecule
Emp. Form.C19H19N3O2
Mol. Mass.321.3731
SMILESOc1ccccc1C(=O)\C=C\N1CC2CC1CN2c1ccccn1