Reaction Details
TargetMicrotubule-associated protein tau
LigandBDBM50198624
Substrate/Competitorn/a
Meas. Tech.ChEBML_1620755
IC50 660±n/a nM
Citation Okuda, MHijikuro, IFujita, YTeruya, TKawakami, HTakahashi, TSugimoto, H Design and synthesis of curcumin derivatives as tau and amyloidß dual aggregation inhibitors. Bioorg Med Chem Lett26:5024-5028 (2016) 
 
Microtubule-associated protein tau
Name:Microtubule-associated protein tau
Type:Protein
Mol. Mass.:78928.63
Organism:Homo sapiens (Human)
Description:P10636
Residue:758
BDBM50198624
NameBDBM50198624
Synonyms:CHEMBL3953399
TypeSmall organic molecule
Emp. Form.C28H24N4O2
Mol. Mass.448.5158
SMILESCOc1cc(OCc2ccccn2)ccc1\C=C\c1cc(\C=C\c2ccc3cc[nH]c3c2)[nH]n1