Reaction Details
TargetCDGSH iron-sulfur domain-containing protein 1
LigandBDBM50198880
Substrate/Competitorn/a
Meas. Tech.ChEMBL_1620948 (CHEMBL3863231)
Ki 139±n/a nM
Citation Geldenhuys, WJYonutas, HMMorris, DLSullivan, PGDarvesh, ASLeeper, TC Identification of small molecules that bind to the mitochondrial protein mitoNEET. Bioorg Med Chem Lett26:5350-5353 (2016) 
 
CDGSH iron-sulfur domain-containing protein 1
Name:CDGSH iron-sulfur domain-containing protein 1
Type:PROTEIN
Mol. Mass.:12206.48
Organism:Homo sapiens (Human)
Description:ChEMBL_766432
Residue:108
BDBM50198880
NameBDBM50198880
Synonyms:CHEMBL3976274
TypeSmall organic molecule
Emp. Form.C12H7N3O2S
Mol. Mass.257.268
SMILESO=C1NC(=O)\C(S1)=C\c1cccc2nccnc12