Reaction Details
TargetCDGSH iron-sulfur domain-containing protein 1
LigandBDBM50198885
Substrate/Competitorn/a
Meas. Tech.ChEMBL_1620948 (CHEMBL3863231)
Ki 412±n/a nM
Citation Geldenhuys, WJYonutas, HMMorris, DLSullivan, PGDarvesh, ASLeeper, TC Identification of small molecules that bind to the mitochondrial protein mitoNEET. Bioorg Med Chem Lett26:5350-5353 (2016) 
 
CDGSH iron-sulfur domain-containing protein 1
Name:CDGSH iron-sulfur domain-containing protein 1
Type:PROTEIN
Mol. Mass.:12206.48
Organism:Homo sapiens (Human)
Description:ChEMBL_766432
Residue:108
BDBM50198885
NameBDBM50198885
Synonyms:CHEMBL3967264
TypeSmall organic molecule
Emp. Form.C13H11NO3S2
Mol. Mass.293.361
SMILESOC(=O)CCN1C(=S)S\C(=C/c2ccccc2)C1=O