Reaction Details
TargetCDGSH iron-sulfur domain-containing protein 1
LigandBDBM7462
Substrate/Competitorn/a
Meas. Tech.ChEMBL_1620948 (CHEMBL3863231)
Ki 132±n/a nM
Citation Geldenhuys, WJYonutas, HMMorris, DLSullivan, PGDarvesh, ASLeeper, TC Identification of small molecules that bind to the mitochondrial protein mitoNEET. Bioorg Med Chem Lett26:5350-5353 (2016) 
 
CDGSH iron-sulfur domain-containing protein 1
Name:CDGSH iron-sulfur domain-containing protein 1
Type:PROTEIN
Mol. Mass.:12206.48
Organism:Homo sapiens (Human)
Description:ChEMBL_766432
Residue:108
BDBM7462
NameBDBM7462
Synonyms:3,5,7-trihydroxy-2-(4-hydroxyphenyl)-4H-chromen-4-one CHEMBL150 Kaempferol (Kmp) kaempferol
TypeSmall organic molecule
Emp. Form.C15H10O6
Mol. Mass.286.2363
SMILESOc1ccc(cc1)-c1oc2cc(O)cc(O)c2c(=O)c1O