Reaction Details
TargetCDGSH iron-sulfur domain-containing protein 1
LigandBDBM50198891
Substrate/Competitorn/a
Meas. Tech.ChEMBL_1620947 (CHEMBL3863230)
IC50 518±n/a nM
Citation Geldenhuys, WJYonutas, HMMorris, DLSullivan, PGDarvesh, ASLeeper, TC Identification of small molecules that bind to the mitochondrial protein mitoNEET. Bioorg Med Chem Lett26:5350-5353 (2016) 
 
CDGSH iron-sulfur domain-containing protein 1
Name:CDGSH iron-sulfur domain-containing protein 1
Type:PROTEIN
Mol. Mass.:12206.48
Organism:Homo sapiens (Human)
Description:ChEMBL_766432
Residue:108
BDBM50198891
NameBDBM50198891
Synonyms:CHEMBL3893332
TypeSmall organic molecule
Emp. Form.C19H17NO3S2
Mol. Mass.371.473
SMILESCOc1cc(\C=C2\SC(=S)NC2=O)ccc1OCc1ccc(C)cc1