Reaction Details
TargetCDGSH iron-sulfur domain-containing protein 1
LigandBDBM50198771
Substrate/Competitorn/a
Meas. Tech.ChEMBL_1620947 (CHEMBL3863230)
IC50 910±n/a nM
Citation Geldenhuys, WJYonutas, HMMorris, DLSullivan, PGDarvesh, ASLeeper, TC Identification of small molecules that bind to the mitochondrial protein mitoNEET. Bioorg Med Chem Lett26:5350-5353 (2016) 
 
CDGSH iron-sulfur domain-containing protein 1
Name:CDGSH iron-sulfur domain-containing protein 1
Type:PROTEIN
Mol. Mass.:12206.48
Organism:Homo sapiens (Human)
Description:ChEMBL_766432
Residue:108
BDBM50198771
NameBDBM50198771
Synonyms:CHEMBL3948168
TypeSmall organic molecule
Emp. Form.C17H15NO3
Mol. Mass.281.3059
SMILESCN(C)c1ccc(\C=C2\Oc3cc(O)ccc3C2=O)cc1