Reaction Details
TargetCDGSH iron-sulfur domain-containing protein 1
LigandBDBM4324
Substrate/Competitorn/a
Meas. Tech.ChEMBL_1620948 (CHEMBL3863231)
Ki 78±n/a nM
Citation Geldenhuys, WJYonutas, HMMorris, DLSullivan, PGDarvesh, ASLeeper, TC Identification of small molecules that bind to the mitochondrial protein mitoNEET. Bioorg Med Chem Lett26:5350-5353 (2016) 
 
CDGSH iron-sulfur domain-containing protein 1
Name:CDGSH iron-sulfur domain-containing protein 1
Type:PROTEIN
Mol. Mass.:12206.48
Organism:Homo sapiens (Human)
Description:ChEMBL_766432
Residue:108
BDBM4324
NameBDBM4324
Synonyms:2-[(4-hydroxyphenyl)methylidene]propanedinitrile | benzylidenemalononitrile (BMN) deriv. 8
TypeSmall organic molecule
Emp. Form.C10H6N2O
Mol. Mass.170.1674
SMILES[#8]-c1ccc(\[#6]=[#6](/C#N)C#N)cc1