Reaction Details
Target5-hydroxytryptamine receptor 2B
LigandBDBM50098551
Substrate/Competitorn/a
Meas. Tech.ChEMBL_1621385 (CHEMBL3863668)
Ki 5.0±n/a nM
Citation Ofori, EZhu, XYEtukala, JRBricker, BAAblordeppey, SY Synthesis and evaluation of the structural elements in alkylated tetrahydroisoquinolines for binding to CNS receptors. Bioorg Med Chem24:5730-5740 (2016) 
 
5-hydroxytryptamine receptor 2B
Name:5-hydroxytryptamine receptor 2B
Type:G Protein-Coupled Receptor (GPCR)
Mol. Mass.:54312.47
Organism:Homo sapiens (Human)
Description:Receptor binding assays were performed using human clone stably expressed in CHO cells.
Residue:481
BDBM50098551
NameBDBM50098551
Synonyms:(R)-3-(2-(2-(4-methylpiperidin-1-yl)ethyl)pyrrolidin-1-ylsulfonyl)phenol 3-{(R)-2-[2-(4-Methyl-piperidin-1-yl)-ethyl]-pyrrolidine-1-sulfonyl}-phenol 3-{2-[2-(4-Methyl-piperidin-1-yl)-ethyl]-pyrrolidine-1-sulfonyl}-phenol CHEMBL282199 | SB-269970
TypeSmall organic molecule
Emp. Form.C18H28N2O3S
Mol. Mass.352.492
SMILESCC1CCN(CC[C@H]2CCCN2S(=O)(=O)c2cccc(O)c2)CC1