Reaction Details
TargetTransmembrane domain-containing protein TMIGD3
LigandBDBM50199456
Substrate/Competitorn/a
Meas. Tech.ChEMBL_1621587 (CHEMBL3863870)
Ki 1200±n/a nM
Citation Tosh, DKCiancetta, AWarnick, ECrane, SGao, ZGJacobson, KA Structure-Based Scaffold Repurposing for G Protein-Coupled Receptors: Transformation of Adenosine Derivatives into 5HT J Med Chem59:11006-11026 (2016) 
 
Transmembrane domain-containing protein TMIGD3
Name:Transmembrane domain-containing protein TMIGD3
Type:PROTEIN
Mol. Mass.:30335.79
Organism:Homo sapiens (Human)
Description:ChEMBL_114868
Residue:266
BDBM50199456
NameBDBM50199456
Synonyms:CHEMBL3904817
TypeSmall organic molecule
Emp. Form.C17H24ClN5O3
Mol. Mass.381.857
SMILES[H][C@]12C[C@@]1(CO)[C@@H](O)[C@@H](O)[C@@H]2n1cnc2c(NC(CC)CC)nc(Cl)nc12