Reaction Details
TargetTransmembrane domain-containing protein TMIGD3
LigandBDBM50199472
Substrate/Competitorn/a
Meas. Tech.ChEMBL_1621587 (CHEMBL3863870)
Ki 120±n/a nM
Citation Tosh, DKCiancetta, AWarnick, ECrane, SGao, ZGJacobson, KA Structure-Based Scaffold Repurposing for G Protein-Coupled Receptors: Transformation of Adenosine Derivatives into 5HT J Med Chem59:11006-11026 (2016) 
 
Transmembrane domain-containing protein TMIGD3
Name:Transmembrane domain-containing protein TMIGD3
Type:PROTEIN
Mol. Mass.:30335.79
Organism:Homo sapiens (Human)
Description:ChEMBL_114868
Residue:266
BDBM50199472
NameBDBM50199472
Synonyms:CHEMBL3941980
TypeSmall organic molecule
Emp. Form.C20H12ClF2N5
Mol. Mass.395.793
SMILESFc1ccc(cc1F)C#Cc1nc(NCc2cccc(Cl)c2)c2nc[nH]c2n1