Reaction Details
TargetTransmembrane domain-containing protein TMIGD3
LigandBDBM50199470
Substrate/Competitorn/a
Meas. Tech.ChEMBL_1621587 (CHEMBL3863870)
Ki 1480±n/a nM
Citation Tosh, DKCiancetta, AWarnick, ECrane, SGao, ZGJacobson, KA Structure-Based Scaffold Repurposing for G Protein-Coupled Receptors: Transformation of Adenosine Derivatives into 5HT J Med Chem59:11006-11026 (2016) 
 
Transmembrane domain-containing protein TMIGD3
Name:Transmembrane domain-containing protein TMIGD3
Type:PROTEIN
Mol. Mass.:30335.79
Organism:Homo sapiens (Human)
Description:ChEMBL_114868
Residue:266
BDBM50199470
NameBDBM50199470
Synonyms:CHEMBL3941738
TypeSmall organic molecule
Emp. Form.C15H19ClN6O3
Mol. Mass.366.803
SMILES[H][C@]12C[C@]1([C@@H](O)[C@@H](O)[C@@H]2n1cnc2c(nc(Cl)nc12)N(C)C)C(=O)NC