Reaction Details
TargetShiga toxin subunit A
LigandBDBM50199475
Substrate/Competitorn/a
Meas. Tech.ChEMBL_1621651 (CHEMBL3863934)
Ki 3360±n/a nM
Citation Chauhan, VChaudhary, DPathak, USaxena, NDhaked, RK In Silico Discovery and Validation of Amide Based Small Molecule Targeting the Enzymatic Site of Shiga Toxin. J Med Chem59:10763-10773 (2016) 
 
Shiga toxin subunit A
Name:Shiga toxin subunit A
Type:PROTEIN
Mol. Mass.:34823.39
Organism:Shigella dysenteriae
Description:ChEMBL_116947
Residue:315
BDBM50199475
NameBDBM50199475
Synonyms:CHEMBL3939786
TypeSmall organic molecule
Emp. Form.C15H12FNO2
Mol. Mass.257.2597
SMILESCC(=O)c1ccccc1NC(=O)c1ccc(F)cc1