Reaction Details
TargetSodium-dependent dopamine transporter
LigandBDBM50199799
Substrate/Competitorn/a
Meas. Tech.ChEMBL_1621702 (CHEMBL3863985)
Ki 7.6±n/a nM
Citation Cao, JSlack, RDBakare, OMBurzynski, CRais, RSlusher, BSKopajtic, TBonifazi, AEllenberger, MPYano, HHe, YBi, GHXi, ZXLoland, CJNewman, AH Novel and High Affinity 2-[(Diphenylmethyl)sulfinyl]acetamide (Modafinil) Analogues as Atypical Dopamine Transporter Inhibitors. J Med Chem59:10676-10691 (2016) 
 
Sodium-dependent dopamine transporter
Name:Sodium-dependent dopamine transporter
Type:Multi-pass membrane protein
Mol. Mass.:68749.45
Organism:Rattus norvegicus (rat)
Description:P23977
Residue:619
BDBM50199799
NameBDBM50199799
Synonyms:CHEMBL3971463
TypeSmall organic molecule
Emp. Form.C26H27ClF2N2OS
Mol. Mass.489.02
SMILES[O-][S+](CCN1CCN(Cc2ccc(Cl)cc2)CC1)C(c1ccc(F)cc1)c1ccc(F)cc1