Reaction Details
TargetSodium-dependent dopamine transporter
LigandBDBM50199809
Substrate/Competitorn/a
Meas. Tech.ChEMBL_1621702 (CHEMBL3863985)
Ki 3.4±n/a nM
Citation Cao, JSlack, RDBakare, OMBurzynski, CRais, RSlusher, BSKopajtic, TBonifazi, AEllenberger, MPYano, HHe, YBi, GHXi, ZXLoland, CJNewman, AH Novel and High Affinity 2-[(Diphenylmethyl)sulfinyl]acetamide (Modafinil) Analogues as Atypical Dopamine Transporter Inhibitors. J Med Chem59:10676-10691 (2016) 
 
Sodium-dependent dopamine transporter
Name:Sodium-dependent dopamine transporter
Type:Multi-pass membrane protein
Mol. Mass.:68749.45
Organism:Rattus norvegicus (rat)
Description:P23977
Residue:619
BDBM50199809
NameBDBM50199809
Synonyms:CHEMBL3890247
TypeSmall organic molecule
Emp. Form.C28H34N2O2S
Mol. Mass.462.647
SMILESOC(CN1CCN(CC[S+]([O-])C(c2ccccc2)c2ccccc2)CC1)Cc1ccccc1