Reaction Details
TargetSigma non-opioid intracellular receptor 1
LigandBDBM50061885
Substrate/Competitorn/a
Meas. Tech.ChEMBL_1621710 (CHEMBL3863993)
Ki 2.4±n/a nM
Citation Cao, JSlack, RDBakare, OMBurzynski, CRais, RSlusher, BSKopajtic, TBonifazi, AEllenberger, MPYano, HHe, YBi, GHXi, ZXLoland, CJNewman, AH Novel and High Affinity 2-[(Diphenylmethyl)sulfinyl]acetamide (Modafinil) Analogues as Atypical Dopamine Transporter Inhibitors. J Med Chem59:10676-10691 (2016) 
 
Sigma non-opioid intracellular receptor 1
Name:Sigma non-opioid intracellular receptor 1
Type:Protein
Mol. Mass.:25307.17
Organism:Cavia porcellus (Guinea pig)
Description:Q60492
Residue:223
BDBM50061885
NameBDBM50061885
Synonyms:3-[Bis-(4-fluoro-phenyl)-methoxy]-8-butyl-8-aza-bicyclo[3.2.1]octane | CHEMBL11493
TypeSmall organic molecule
Emp. Form.C24H29F2NO
Mol. Mass.385.49
SMILESCCCCN1C2CCC1CC(C2)OC(c1ccc(F)cc1)c1ccc(F)cc1