Reaction Details
TargetSodium-dependent dopamine transporter
LigandBDBM50199800
Substrate/Competitorn/a
Meas. Tech.ChEMBL_1621702 (CHEMBL3863985)
Ki 2.5±n/a nM
Citation Cao, JSlack, RDBakare, OMBurzynski, CRais, RSlusher, BSKopajtic, TBonifazi, AEllenberger, MPYano, HHe, YBi, GHXi, ZXLoland, CJNewman, AH Novel and High Affinity 2-[(Diphenylmethyl)sulfinyl]acetamide (Modafinil) Analogues as Atypical Dopamine Transporter Inhibitors. J Med Chem59:10676-10691 (2016) 
 
Sodium-dependent dopamine transporter
Name:Sodium-dependent dopamine transporter
Type:Multi-pass membrane protein
Mol. Mass.:68749.45
Organism:Rattus norvegicus (rat)
Description:P23977
Residue:619
BDBM50199800
NameBDBM50199800
Synonyms:CHEMBL3979590 US11555013, Compound 9g | US9862679, Compound 9g
TypeSmall organic molecule
Emp. Form.C28H34N2OS
Mol. Mass.446.647
SMILESOC(CN1CCN(CCSC(c2ccccc2)c2ccccc2)CC1)Cc1ccccc1