Reaction Details
TargetKelch-like ECH-associated protein 1
LigandBDBM50006933
Substrate/Competitorn/a
Meas. Tech.ChEMBL_1622118 (CHEMBL3864470)
Kd 21±n/a nM
Citation Jiang, ZYLu, MCYou, QD Discovery and Development of Kelch-like ECH-Associated Protein 1. Nuclear Factor Erythroid 2-Related Factor 2 (KEAP1:NRF2) Protein-Protein Interaction Inhibitors: Achievements, Challenges, and Future Directions. J Med Chem59:10837-10858 (2016) 
 
Kelch-like ECH-associated protein 1
Name:Kelch-like ECH-associated protein 1
Type:PROTEIN
Mol. Mass.:69664.53
Organism:Homo sapiens (Human)
Description:ChEMBL_107924
Residue:624
BDBM50006933
NameBDBM50006933
Synonyms:CHEMBL3134422
TypeSmall organic molecule
Emp. Form.C48H72N10O19
Mol. Mass.1093.1409
SMILESCC(C)C[C@H](NC(=O)[C@H](Cc1ccccc1)NC(=O)[C@H](CCC(O)=O)NC(=O)CNC(=O)[C@@H](NC(=O)[C@H](CCC(O)=O)NC(=O)[C@H](CCC(O)=O)NC(=O)[C@H](CC(O)=O)NC(=O)[C@H](CC(C)C)NC(C)=O)[C@@H](C)O)C(N)=O