Reaction Details
TargetKelch-like ECH-associated protein 1
LigandBDBM50200465
Substrate/Competitorn/a
Meas. Tech.ChEMBL_1622115 (CHEMBL3864467)
IC50 3570±n/a nM
Citation Jiang, ZYLu, MCYou, QD Discovery and Development of Kelch-like ECH-Associated Protein 1. Nuclear Factor Erythroid 2-Related Factor 2 (KEAP1:NRF2) Protein-Protein Interaction Inhibitors: Achievements, Challenges, and Future Directions. J Med Chem59:10837-10858 (2016) 
 
Kelch-like ECH-associated protein 1
Name:Kelch-like ECH-associated protein 1
Type:PROTEIN
Mol. Mass.:69664.53
Organism:Homo sapiens (Human)
Description:ChEMBL_107924
Residue:624
BDBM50200465
NameBDBM50200465
Synonyms:CHEMBL3975863
TypeSmall organic molecule
Emp. Form.C46H70N10O18
Mol. Mass.1051.1042
SMILESCC(C)C[C@H](N)C(=O)N[C@@H](CC(O)=O)C(=O)N[C@@H](CCC(O)=O)C(=O)N[C@@H](CCC(O)=O)C(=O)N[C@@H]([C@@H](C)O)C(=O)NCC(=O)N[C@@H](CCC(O)=O)C(=O)N[C@@H](Cc1ccccc1)C(=O)N[C@@H](CC(C)C)C(N)=O