Reaction Details
TargetGlutamate receptor ionotropic, kainate 3
LigandBDBM50178136
Substrate/Competitorn/a
Meas. Tech.ChEMBL_1622444 (CHEMBL3864796)
IC50 4000±n/a nM
Citation Szymanska, EChalupnik, PSzczepanska, KCuņado Moral, AMPickering, DSNielsen, BJohansen, TNKiec-Kononowicz, K Design, synthesis and structure-activity relationships of novel phenylalanine-based amino acids as kainate receptors ligands. Bioorg Med Chem Lett26:5568-5572 (2016) 
 
Glutamate receptor ionotropic, kainate 3
Name:Glutamate receptor ionotropic, kainate 3
Type:Enzyme Catalytic Domain
Mol. Mass.:104046.44
Organism:Homo sapiens (Human)
Description:Glutamate-Kainate 7 0 HUMAN::Q13003
Residue:919
BDBM50178136
NameBDBM50178136
Synonyms:(S)-1-(2-amino-2-carboxyethyl)-3-(2-carboxybenzyl)-pyrimidine-2,4-dione (S)-2-((3-(2-amino-2-carboxyethyl)-2,6-dioxo-2,3-dihydropyrimidin-1(6H)-yl)methyl)benzoic acid UBP-302
TypeSmall organic molecule
Emp. Form.C15H15N3O6
Mol. Mass.333.2961
SMILESN[C@@H](Cn1ccc(=O)n(Cc2ccccc2C(O)=O)c1=O)C(O)=O