Reaction Details
TargetGlutamate receptor ionotropic, kainate 2
LigandBDBM50200526
Substrate/Competitorn/a
Meas. Tech.ChEMBL_1622442 (CHEMBL3864794)
Ki 50±n/a nM
Citation Szymanska, EChalupnik, PSzczepanska, KCuņado Moral, AMPickering, DSNielsen, BJohansen, TNKiec-Kononowicz, K Design, synthesis and structure-activity relationships of novel phenylalanine-based amino acids as kainate receptors ligands. Bioorg Med Chem Lett26:5568-5572 (2016) 
 
Glutamate receptor ionotropic, kainate 2
Name:Glutamate receptor ionotropic, kainate 2
Type:Enzyme Catalytic Domain
Mol. Mass.:102592.78
Organism:Homo sapiens (Human)
Description:Q13002
Residue:908
BDBM50200526
NameBDBM50200526
Synonyms:CHEMBL1234118
TypeSmall organic molecule
Emp. Form.C16H24F2N2O4
Mol. Mass.346.3696
SMILESOC(=O)[C@@H]1CC(F)(F)CN1C[C@H]1CC[C@H]2CN[C@@H](C[C@H]2C1)C(O)=O