Reaction Details
TargetCaspase-4
LigandBDBM50200543
Substrate/Competitorn/a
Meas. Tech.ChEMBL_1622626 (CHEMBL3864978)
IC50 400±n/a nM
Citation Kent, CRBryja, MGustafson, HAKawarski, MYLenti, GPierce, ENKnopp, RCCeja, VPati, BWalters, DEKarver, CE Variation of the aryl substituent on the piperazine ring within the 4-(piperazin-1-yl)-2,6-di(pyrrolidin-1-yl)pyrimidine scaffold unveils potent, non-competitive inhibitors of the inflammatory caspases. Bioorg Med Chem Lett26:5476-5480 (2016) 
 
Caspase-4
Name:Caspase-4
Type:Enzyme
Mol. Mass.:43257.75
Organism:Homo sapiens (Human)
Description:P49662
Residue:377
BDBM50200543
NameBDBM50200543
Synonyms:CHEMBL3941088
TypeSmall organic molecule
Emp. Form.C25H36N6O2
Mol. Mass.452.5923
SMILESCOc1cc(CN2CCN(CC2)c2cc(nc(n2)N2CCCC2)N2CCCC2)cc(OC)c1