Reaction Details
TargetCaspase-4
LigandBDBM50200550
Substrate/Competitorn/a
Meas. Tech.ChEMBL_1622626 (CHEMBL3864978)
IC50 560±n/a nM
Citation Kent, CRBryja, MGustafson, HAKawarski, MYLenti, GPierce, ENKnopp, RCCeja, VPati, BWalters, DEKarver, CE Variation of the aryl substituent on the piperazine ring within the 4-(piperazin-1-yl)-2,6-di(pyrrolidin-1-yl)pyrimidine scaffold unveils potent, non-competitive inhibitors of the inflammatory caspases. Bioorg Med Chem Lett26:5476-5480 (2016) 
 
Caspase-4
Name:Caspase-4
Type:Enzyme
Mol. Mass.:43257.75
Organism:Homo sapiens (Human)
Description:P49662
Residue:377
BDBM50200550
NameBDBM50200550
Synonyms:CHEMBL3905486
TypeSmall organic molecule
Emp. Form.C16H26N6
Mol. Mass.302.4178
SMILESC1CCN(C1)c1cc(nc(n1)N1CCCC1)N1CCNCC1