Reaction Details
TargetCaspase-4
LigandBDBM50200553
Substrate/Competitorn/a
Meas. Tech.ChEMBL_1622626 (CHEMBL3864978)
Ki 248±n/a nM
Citation Kent, CRBryja, MGustafson, HAKawarski, MYLenti, GPierce, ENKnopp, RCCeja, VPati, BWalters, DEKarver, CE Variation of the aryl substituent on the piperazine ring within the 4-(piperazin-1-yl)-2,6-di(pyrrolidin-1-yl)pyrimidine scaffold unveils potent, non-competitive inhibitors of the inflammatory caspases. Bioorg Med Chem Lett26:5476-5480 (2016) 
 
Caspase-4
Name:Caspase-4
Type:Enzyme
Mol. Mass.:43257.75
Organism:Homo sapiens (Human)
Description:P49662
Residue:377
BDBM50200553
NameBDBM50200553
Synonyms:CHEMBL3898379
TypeSmall organic molecule
Emp. Form.C30H44N6O2
Mol. Mass.520.7094
SMILESCC1Oc2c(C)c(C)c(O)c(C)c2CC1CN1CCN(CC1)c1cc(nc(n1)N1CCCC1)N1CCCC1