Reaction Details
TargetCaspase-4
LigandBDBM50200551
Substrate/Competitorn/a
Meas. Tech.ChEMBL_1622626 (CHEMBL3864978)
IC50 826±n/a nM
Citation Kent, CRBryja, MGustafson, HAKawarski, MYLenti, GPierce, ENKnopp, RCCeja, VPati, BWalters, DEKarver, CE Variation of the aryl substituent on the piperazine ring within the 4-(piperazin-1-yl)-2,6-di(pyrrolidin-1-yl)pyrimidine scaffold unveils potent, non-competitive inhibitors of the inflammatory caspases. Bioorg Med Chem Lett26:5476-5480 (2016) 
 
Caspase-4
Name:Caspase-4
Type:Enzyme
Mol. Mass.:43257.75
Organism:Homo sapiens (Human)
Description:P49662
Residue:377
BDBM50200551
NameBDBM50200551
Synonyms:CHEMBL3978901
TypeSmall organic molecule
Emp. Form.C23H38N6
Mol. Mass.398.588
SMILESC(C1CCCCC1)N1CCN(CC1)c1cc(nc(n1)N1CCCC1)N1CCCC1