Reaction Details
TargetCaspase-4
LigandBDBM166683
Substrate/Competitorn/a
Meas. Tech.ChEMBL_1622626 (CHEMBL3864978)
IC50 909±n/a nM
Citation Kent, CRBryja, MGustafson, HAKawarski, MYLenti, GPierce, ENKnopp, RCCeja, VPati, BWalters, DEKarver, CE Variation of the aryl substituent on the piperazine ring within the 4-(piperazin-1-yl)-2,6-di(pyrrolidin-1-yl)pyrimidine scaffold unveils potent, non-competitive inhibitors of the inflammatory caspases. Bioorg Med Chem Lett26:5476-5480 (2016) 
 
Caspase-4
Name:Caspase-4
Type:Enzyme
Mol. Mass.:43257.75
Organism:Homo sapiens (Human)
Description:P49662
Residue:377
BDBM166683
NameBDBM166683
Synonyms:U74389G (B9)
TypeSmall organic molecule
Emp. Form.C37H50N6O2
Mol. Mass.610.8319
SMILESC[C@]12CC=C3[C@@H](CCC4=CC(=O)C=C[C@]34C)[C@@H]1CC[C@@H]2C(=O)CN1CCN(CC1)c1cc(nc(n1)N1CCCC1)N1CCCC1