Reaction Details
TargetVoltage-dependent T-type calcium channel subunit alpha-1I
LigandBDBM50200856
Substrate/Competitorn/a
Meas. Tech.ChEMBL_1622853 (CHEMBL3865205)
IC50 12±n/a nM
Citation Siegrist, RPozzi, DJacob, GTorrisi, CColas, KBraibant, BMawet, JPfeifer, Tde Kanter, RRoch, CKessler, MCorminboeuf, OBezençon, O Structure-Activity Relationship, Drug Metabolism and Pharmacokinetics Properties Optimization, and in Vivo Studies of New Brain Penetrant Triple T-Type Calcium Channel Blockers. J Med Chem59:10661-10675 (2016) 
 
Voltage-dependent T-type calcium channel subunit alpha-1I
Name:Voltage-dependent T-type calcium channel subunit alpha-1I
Type:PROTEIN
Mol. Mass.:245101.25
Organism:Homo sapiens (Human)
Description:ChEMBL_538845
Residue:2223
BDBM50200856
NameBDBM50200856
Synonyms:CHEMBL3956823
TypeSmall organic molecule
Emp. Form.C26H30N4O2
Mol. Mass.430.542
SMILESCOc1ccc(CNC(=O)N2[C@H](C)CN(Cc3ccccc3)c3cnccc3[C@@H]2C)cc1