Reaction Details
TargetVoltage-dependent T-type calcium channel subunit alpha-1I
LigandBDBM50200778
Substrate/Competitorn/a
Meas. Tech.ChEMBL_1622853 (CHEMBL3865205)
IC50 10.0±n/a nM
Citation Siegrist, RPozzi, DJacob, GTorrisi, CColas, KBraibant, BMawet, JPfeifer, Tde Kanter, RRoch, CKessler, MCorminboeuf, OBezençon, O Structure-Activity Relationship, Drug Metabolism and Pharmacokinetics Properties Optimization, and in Vivo Studies of New Brain Penetrant Triple T-Type Calcium Channel Blockers. J Med Chem59:10661-10675 (2016) 
 
Voltage-dependent T-type calcium channel subunit alpha-1I
Name:Voltage-dependent T-type calcium channel subunit alpha-1I
Type:PROTEIN
Mol. Mass.:245101.25
Organism:Homo sapiens (Human)
Description:ChEMBL_538845
Residue:2223
BDBM50200778
NameBDBM50200778
Synonyms:CHEMBL3926060
TypeSmall organic molecule
Emp. Form.C24H25F3N4O2
Mol. Mass.458.4761
SMILESC[C@@H]1CN(Cc2ccc(o2)C(F)(F)F)c2cnccc2[C@H](C)N1C(=O)NCc1ccccc1