Reaction Details
TargetAdenosine receptor A2a
LigandBDBM50200986
Substrate/Competitorn/a
Meas. Tech.ChEMBL_1622887 (CHEMBL3865239)
Ki 0.500000±n/a nM
Citation Rosse, G Quinazoline Carboxamides as Selective Antagonists of Adenosine 2A Receptor. ACS Med Chem Lett7:1014-1015 (2016) 
 
Adenosine receptor A2a
Name:Adenosine receptor A2a
Type:G Protein-Coupled Receptor (GPCR)
Mol. Mass.:44716.46
Organism:Homo sapiens (Human)
Description:P29274
Residue:412
BDBM50200986
NameBDBM50200986
Synonyms:CHEMBL3902955 | US10138212, Example 48
TypeSmall organic molecule
Emp. Form.C22H25N5O3
Mol. Mass.407.4656
SMILESCOc1cccc2c(nc(N)nc12)C(=O)NCc1cccc(COC2CCCC2)n1