Reaction Details
TargetAdenosine receptor A2a
LigandBDBM50201016
Substrate/Competitorn/a
Meas. Tech.ChEMBL_1622887 (CHEMBL3865239)
Ki 1.5±n/a nM
Citation Rosse, G Quinazoline Carboxamides as Selective Antagonists of Adenosine 2A Receptor. ACS Med Chem Lett7:1014-1015 (2016) 
 
Adenosine receptor A2a
Name:Adenosine receptor A2a
Type:G Protein-Coupled Receptor (GPCR)
Mol. Mass.:44716.46
Organism:Homo sapiens (Human)
Description:P29274
Residue:412
BDBM50201016
NameBDBM50201016
Synonyms:CHEMBL3901883 | US10138212, Example 27
TypeSmall organic molecule
Emp. Form.C16H14FN5O2
Mol. Mass.327.3131
SMILESCOc1cccc2c(nc(N)nc12)C(=O)NCc1cccc(F)n1